Target
Adenosine receptor A1
Ligand
BDBM50025683
Substrate
Meas. Tech.
ChEBML_29624
Ki
140±n/a nM
Citation
 Jacobson, KAUkena, DPadgett, WDaly, JWKirk, KL Xanthine functionalized congeners as potent ligands at A2-adenosine receptors. J Med Chem 30:211-4 (1987)  
Target
Name:
Adenosine receptor A1
Synonyms:
AA1R_RAT ADENOSINE A1 high Adenosine A1 receptor (A1) Adenosine receptors A1 | Adora1
Type:
Protein
Mol. Mass.:
36704.13
Organism:
Rattus norvegicus (rat)
Description:
Residue:
326
  
Inhibitor
Name:
BDBM50025683
Synonyms:
CHEMBL307313 | Propionic acid 4-(1,3-diethyl-2,6-dioxo-2,3,6,7-tetrahydro-1H-purin-8-yl)-phenoxymethyl ester
Type:
Small organic molecule
Emp. Form.:
C19H22N4O5
Mol. Mass.:
386.4018
SMILES:
CCC(=O)OCOc1ccc(cc1)-c1nc2n(CC)c(=O)n(CC)c(=O)c2[nH]1
: