Target
Adenosine receptor A1
Ligand
BDBM50025684
Substrate
Meas. Tech.
ChEBML_29624
Ki
90±n/a nM
Citation
 Jacobson, KAUkena, DPadgett, WDaly, JWKirk, KL Xanthine functionalized congeners as potent ligands at A2-adenosine receptors. J Med Chem 30:211-4 (1987)  
Target
Name:
Adenosine receptor A1
Synonyms:
AA1R_RAT ADENOSINE A1 high Adenosine A1 receptor (A1) Adenosine receptors A1 | Adora1
Type:
Protein
Mol. Mass.:
36704.13
Organism:
Rattus norvegicus (rat)
Description:
Residue:
326
  
Inhibitor
Name:
BDBM50025684
Synonyms:
CHEMBL305212 | Isobutyric acid 4-(1,3-diethyl-2,6-dioxo-2,3,6,7-tetrahydro-1H-purin-8-yl)-phenoxymethyl ester
Type:
Small organic molecule
Emp. Form.:
C20H24N4O5
Mol. Mass.:
400.4284
SMILES:
CCn1c2nc([nH]c2c(=O)n(CC)c1=O)-c1ccc(OCOC(=O)C(C)C)cc1
: