Target
Aurora kinase A
Ligand
BDBM50467363
Substrate
Meas. Tech.
ChEMBL_1795905 (CHEMBL4268022)
IC50
78±n/a nM
Citation
 Zhang, QShen, QGao, LTong, LLi, JChen, YLu, W Pyrazolo[4,3-b]pyrimido[4,5-e][1,4]diazepine derivatives as new multi-targeted inhibitors of Aurora A/B and KDR. Eur J Med Chem 158:428-441 (2018)  
Target
Name:
Aurora kinase A
Synonyms:
AIK ARK1 AURKA AYK1 Aurora kinase A (AURA) Aurora kinase A (Aurora A) Aurora-related kinase 1 BTAK Breast-tumor-amplified kinase STK15 Serine/threonine kinase 15 Serine/threonine-protein kinase aurora A hARK1
Type:
Serine/threonine-protein kinase
Mol. Mass.:
45830.98
Organism:
Homo sapiens (Human)
Description:
O14965
Residue:
403
  
Inhibitor
Name:
BDBM50467363
Synonyms:
CHEMBL4280932
Type:
Small organic molecule
Emp. Form.:
C21H23N7
Mol. Mass.:
373.4542
SMILES:
Cc1[nH]nc2Nc3nc(ncc3C(=Nc12)c1ccc(C)cc1)N1CCCCC1
: