Target
Aurora kinase B/Inner centromere protein
Ligand
BDBM50467642
Substrate
Meas. Tech.
ChEMBL_1796567 (CHEMBL4268684)
IC50
19953±n/a nM
Citation
 Barker, MDLiddle, JAtkinson, FLWilson, DMDickson, MCRamirez-Molina, CLewis, HDavis, RPSomers, DONeu, MJones, EWatson, R Discovery of potent and selective Spleen Tyrosine Kinase inhibitors for the topical treatment of inflammatory skin disease. Bioorg Med Chem Lett 28:3458-3462 (2018)  
Target
Name:
Aurora kinase B/Inner centromere protein
Synonyms:
Aurora B/Incenp
Type:
Protein Complex
Mol. Mass.:
Description:
Components:
This complex has 2 components.
Component 1
Name:
Aurora kinase B
Synonyms:
AIK2 AIM1 ARK2 AURKB_HUMAN Aurora B-INCENP Aurora kinase B (AURKB) STK-1 STK12 Serine/threonine-protein kinase aurora B
Type:
Protein
Mol. Mass.:
39327.72
Organism:
Homo sapiens (Human)
Description:
Q96GD4
Residue:
344
  
Component 2
Name:
Inner centromere protein
Synonyms:
INCENP | INCE_HUMAN
Type:
Protein
Mol. Mass.:
105461.33
Organism:
Homo sapiens (Human)
Description:
Q9NQS7
Residue:
918
  
Inhibitor
Name:
BDBM50467642
Synonyms:
CHEMBL4280691
Type:
Small organic molecule
Emp. Form.:
C20H18N2O3
Mol. Mass.:
334.3685
SMILES:
COc1ccc(cc1)-c1cc(ccc1OCc1ccncn1)C(C)=O
: