Target
E3 ubiquitin-protein ligase Mdm2
Ligand
BDBM50448936
Substrate
Meas. Tech.
ChEMBL_1796587 (CHEMBL4268704)
IC50
0.100000±n/a nM
Citation
 Liao, GYang, DMa, LLi, WHu, LZeng, LWu, PDuan, LLiu, Z The development of piperidinones as potent MDM2-P53 protein-protein interaction inhibitors for cancer therapy. Eur J Med Chem 159:1-9 (2018)  
Target
Name:
E3 ubiquitin-protein ligase Mdm2
Synonyms:
Double minute 2 protein E3 ubiquitin-protein ligase Mdm2 (p53-binding protein Mdm2) Human Double Minute 2 (HDM2) MDM2-MDMX p53-Binding Protein MDM2 | p53-binding protein
Type:
Oncoprotein
Mol. Mass.:
55196.54
Organism:
Homo sapiens (Human)
Description:
Q00987
Residue:
491
  
Inhibitor
Name:
BDBM50448936
Synonyms:
CHEMBL3125527 US9593129, Example 342
Type:
Small organic molecule
Emp. Form.:
C28H35Cl2NO5S
Mol. Mass.:
568.552
SMILES:
CC[C@@H](CS(=O)(=O)C(C)(C)C)N1[C@@H]([C@H](C[C@](C)(CC(O)=O)C1=O)c1cccc(Cl)c1)c1ccc(Cl)cc1
: