Target
Pepsin A
Ligand
BDBM50025892
Substrate
Meas. Tech.
ChEBML_154011
Ki
10±n/a nM
Citation
 Rich, DH Pepstatin-derived inhibitors of aspartic proteinases. A close look at an apparent transition-state analogue inhibitor. J Med Chem 28:263-73 (1985)  
Target
Name:
Pepsin A
Synonyms:
PEPA_PIG Pepsin | Pepsin A precursor
Type:
Enzyme
Mol. Mass.:
41232.87
Organism:
Porcine
Description:
Residue:
385
  
Inhibitor
Name:
BDBM50025892
Synonyms:
3-Hydroxy-6-methyl-4-{3-methyl-2-[3-methyl-2-(3-methyl-butyrylamino)-butyrylamino]-butyrylamino}-heptanoic acid ethyl ester | CHEMBL432824
Type:
Small organic molecule
Emp. Form.:
C25H47N3O6
Mol. Mass.:
485.6572
SMILES:
CCOC(=O)CC(O)[C@H](CC(C)C)NC(=O)[C@@H](NC(=O)[C@@H](NC(=O)CC(C)C)C(C)C)C(C)C
: