Target
Pepsin A
Ligand
BDBM50025887
Substrate
Meas. Tech.
ChEBML_154011
Ki
10±n/a nM
Citation
 Rich, DH Pepstatin-derived inhibitors of aspartic proteinases. A close look at an apparent transition-state analogue inhibitor. J Med Chem 28:263-73 (1985)  
Target
Name:
Pepsin A
Synonyms:
PEPA_PIG Pepsin | Pepsin A precursor
Type:
Enzyme
Mol. Mass.:
41232.87
Organism:
Porcine
Description:
Residue:
385
  
Inhibitor
Name:
BDBM50025887
Synonyms:
6-Methyl-4-{3-methyl-2-[3-methyl-2-(3-methyl-butyrylamino)-butyrylamino]-butyrylamino}-3-oxo-heptanoic acid [1-methyl-2-(4-methyl-pentanoylamino)-2-oxo-ethyl]-amide | CHEMBL314751
Type:
Small organic molecule
Emp. Form.:
C32H57N5O7
Mol. Mass.:
623.8243
SMILES:
CC(C)CCC(=O)NC(=O)[C@H](C)NC(=O)CC(=O)[C@@H](CC(C)C)NC(=O)[C@H](NC(=O)[C@@H](NC(=O)CC(C)C)C(C)C)C(C)C
: