Target
MAP/microtubule affinity-regulating kinase 4
Ligand
BDBM50467764
Substrate
Meas. Tech.
ChEMBL_1796954 (CHEMBL4269071)
IC50
1980±n/a nM
Citation
 Parveen, IKhan, PAli, SHassan, MIAhmed, N Synthesis, molecular docking and inhibition studies of novel 3-N-aryl substituted-2-heteroarylchromones targeting microtubule affinity regulating kinase 4 inhibitors. Eur J Med Chem 159:166-177 (2018)  
Target
Name:
MAP/microtubule affinity-regulating kinase 4
Synonyms:
KIAA1860 MARK4 MARKL1
Type:
PROTEIN
Mol. Mass.:
82561.08
Organism:
Homo sapiens (Human)
Description:
ChEMBL_774620
Residue:
752
  
Inhibitor
Name:
BDBM50467764
Synonyms:
CHEMBL4293547
Type:
Small organic molecule
Emp. Form.:
C19H10Cl2INO3
Mol. Mass.:
498.098
SMILES:
Clc1cc(Cl)c2oc(-c3ccco3)c(Nc3ccc(I)cc3)c(=O)c2c1
: