Target
Toll-like receptor 9
Ligand
BDBM50467773
Substrate
Meas. Tech.
ChEMBL_1796971 (CHEMBL4269088)
IC50
20±n/a nM
Citation
 Paul, BRahaman, ORoy, SPal, SSatish, SMukherjee, AGhosh, ARRaychaudhuri, DBhattacharya, RGoon, SGanguly, DTalukdar, A Activity-guided development of potent and selective toll-like receptor 9 antagonists. Eur J Med Chem 159:187-205 (2018)  
Target
Name:
Toll-like receptor 9
Synonyms:
CD_antigen: CD289 TLR9_HUMAN
Type:
Enzyme
Mol. Mass.:
115889.91
Organism:
Homo sapiens (Human)
Description:
Q9NR96
Residue:
1032
  
Inhibitor
Name:
BDBM50467773
Synonyms:
CHEMBL4282131
Type:
Small organic molecule
Emp. Form.:
C30H47N7O2
Mol. Mass.:
537.7399
SMILES:
COc1cc2c(nc(nc2cc1OCCCN1CCCC1)N1CCN(C)CC1)N1CCN(CC1)C1CCCC1
: