Target
Aldo-keto reductase family 1 member B1
Ligand
BDBM16415
Substrate
Meas. Tech.
ChEMBL_31775 (CHEMBL643101)
IC50
6500±n/a nM
Citation
 Kador, PFKinoshita, JHSharpless, NE Aldose reductase inhibitors: a potential new class of agents for the pharmacological control of certain diabetic complications. J Med Chem 28:841-9 (1985)  
Target
Name:
Aldo-keto reductase family 1 member B1
Synonyms:
AKR1B1 ALDR_HUMAN AR Aldose Reductase (ALR2) Aldose reductase (AR)
Type:
Protein
Mol. Mass.:
35855.50
Organism:
Homo sapiens (Human)
Description:
P15121. 4LAU; 2IKI; 4LB4; 2FZD; 2FZ8; 1US0
Residue:
316
  
Inhibitor
Name:
BDBM16415
Synonyms:
(1,3-dioxo-1H-benzo[de]isoquinolin-2(3H)-yl)acetic acid Alrestatin PiG Tocris-0485
Type:
Small organic molecule
Emp. Form.:
C14H9NO4
Mol. Mass.:
255.2256
SMILES:
OC(=O)CN1C(=O)c2cccc3cccc(C1=O)c23
: