Target
D(3) dopamine receptor
Ligand
BDBM50467925
Substrate
Meas. Tech.
ChEMBL_1797350 (CHEMBL4269467)
Ki
10.0±n/a nM
Citation
 Gadhiya, SCordone, PPal, RKGallicchio, EWickstrom, LKurtzman, TRamsey, SHarding, WW New Dopamine D3-Selective Receptor Ligands Containing a 6-Methoxy-1,2,3,4-tetrahydroisoquinolin-7-ol Motif. ACS Med Chem Lett 9:990-995 (2018)  
Target
Name:
D(3) dopamine receptor
Synonyms:
DOPAMINE D3 DRD3_HUMAN Dopamine D3 receptor (D3) Dopamine receptor Dopamine receptor D3
Type:
Mol. Mass.:
44243.43
Organism:
Homo sapiens (Human)
Description:
Residue:
400
  
Inhibitor
Name:
BDBM50467925
Synonyms:
CHEMBL4280542
Type:
Small organic molecule
Emp. Form.:
C21H25IN2O3
Mol. Mass.:
480.3393
SMILES:
COc1cc2CCN(CCCCNC(=O)c3ccc(I)cc3)Cc2cc1O
: