Target
Cytochrome P450 11B1, mitochondrial
Ligand
BDBM50026000
Substrate
Meas. Tech.
ChEBML_196
IC50
>100000±n/a nM
Citation
 Cross, PEDickinson, RPParry, MJRandall, MJ Selective thromboxane synthetase inhibitors. 1. 1-[(Aryloxy)alkyl]-1H-imidazoles. J Med Chem 28:1427-32 (1985)  
Target
Name:
Cytochrome P450 11B1, mitochondrial
Synonyms:
C11B1_RAT Cyp11b1 Cytochrome P450 11B1
Type:
PROTEIN
Mol. Mass.:
57478.87
Organism:
Rattus norvegicus
Description:
ChEMBL_1475489
Residue:
499
  
Inhibitor
Name:
BDBM50026000
Synonyms:
3-(2-Imidazol-1-yl-ethoxy)-benzoic acid | CHEMBL33407
Type:
Small organic molecule
Emp. Form.:
C12H12N2O3
Mol. Mass.:
232.2353
SMILES:
OC(=O)c1cccc(OCCn2ccnc2)c1
: