Target
Dipeptidyl peptidase 1
Ligand
BDBM50026017
Substrate
Meas. Tech.
ChEBML_53204
Ki
2700±n/a nM
Citation
 Thompson, SAAndrews, PRHanzlik, RP Carboxyl-modified amino acids and peptides as protease inhibitors. J Med Chem 29:104-11 (1986)  
Target
Name:
Dipeptidyl peptidase 1
Synonyms:
CATC_HUMAN CTSC Cathepsin J Dipeptidyl peptidase 1 (DPPI) Dipeptidyl peptidase I (DPPI)
Type:
Enzyme
Mol. Mass.:
51857.28
Organism:
Homo sapiens (Human)
Description:
P53634
Residue:
463
  
Inhibitor
Name:
BDBM50026017
Synonyms:
2-Amino-N-(benzyl-cyano-methyl)-acetamide | CHEMBL12954
Type:
Small organic molecule
Emp. Form.:
C11H13N3O
Mol. Mass.:
203.2404
SMILES:
NCC(=O)NC(Cc1ccccc1)C#N
: