Target
Sensory histidine kinase DcuS
Ligand
BDBM50468034
Substrate
Meas. Tech.
ChEMBL_1797897 (CHEMBL4270014)
IC50
140000±n/a nM
Citation
 Mizar, PArya, RKim, TCha, SRyu, KSYeo, WSBae, TKim, DWPark, KHKim, KKLee, SS Total Synthesis of Xanthoangelol B and Its Various Fragments: Toward Inhibition of Virulence Factor Production of Staphylococcus aureus. J Med Chem 61:10473-10487 (2018)  
Target
Name:
Sensory histidine kinase DcuS
Synonyms:
Receptor-histidine kinase AgrC
Type:
PROTEIN
Mol. Mass.:
49890.25
Organism:
Staphylococcus aureus
Description:
ChEMBL_305973
Residue:
430
  
Inhibitor
Name:
BDBM50468034
Synonyms:
CHEMBL4286992
Type:
Small organic molecule
Emp. Form.:
C25H30O6
Mol. Mass.:
426.5021
SMILES:
CC(=C)C(O)CC\C(C)=C\Cc1c(O)ccc(C(=O)CC(O)c2ccc(O)cc2)c1O
: