Target
Thiosulfate sulfurtransferase
Ligand
BDBM50468064
Substrate
Meas. Tech.
ChEMBL_1797977 (CHEMBL4270094)
IC50
>100000±n/a nM
Citation
 Kunkle, TAbdeen, SSalim, NRay, AMStevens, MAmbrose, AJVictorino, JPark, YHoang, QQChapman, EJohnson, SM Hydroxybiphenylamide GroEL/ES Inhibitors Are Potent Antibacterials against Planktonic and Biofilm Forms of Staphylococcus aureus. J Med Chem 61:10651-10664 (2018)  
Target
Name:
Thiosulfate sulfurtransferase
Synonyms:
2.8.1.1 THTR_HUMAN Thiosulfate sulfurtransferase
Type:
PROTEIN
Mol. Mass.:
33432.06
Organism:
Homo sapiens
Description:
ChEMBL_118080
Residue:
297
  
Inhibitor
Name:
BDBM50468064
Synonyms:
CHEMBL4291977
Type:
Small organic molecule
Emp. Form.:
C20H13BrN2O2S2
Mol. Mass.:
457.363
SMILES:
Oc1ccc(Br)cc1C(=O)Nc1ccc(Sc2nc3ccccc3s2)cc1
: