Target
Peroxisomal N(1)-acetyl-spermine/spermidine oxidase
Ligand
BDBM50015358
Substrate
Meas. Tech.
ChEBML_159843
Ki
90±n/a nM
Citation
 Bey, PBolkenius, FNSeiler, NCasara, P N-2,3-Butadienyl-1,4-butanediamine derivatives: potent irreversible inactivators of mammalian polyamine oxidase. J Med Chem 28:1-2 (1985)  
Target
Name:
Peroxisomal N(1)-acetyl-spermine/spermidine oxidase
Synonyms:
Acetylpolyamine oxidase (APAO) PAOX Peroxisomal N(1)-acetyl-spermine/spermidine oxidase | Polyamine oxidase
Type:
Enzyme
Mol. Mass.:
70274.33
Organism:
Homo sapiens (Human)
Description:
Q6QHF9
Residue:
649
  
Inhibitor
Name:
BDBM50015358
Synonyms:
CHEMBL417844 N,N'-Di-buta-2,3-dienyl-butane-1,4-diamine
Type:
Small organic molecule
Emp. Form.:
C12H20N2
Mol. Mass.:
192.3006
SMILES:
C=C=CCNCCCCNCC=C=C
: