Target
Cyclin-dependent kinase 2
Ligand
BDBM50113281
Substrate
Meas. Tech.
ChEMBL_1799033 (CHEMBL4271325)
IC50
47±n/a nM
Citation
 Kalra, SJoshi, GMunshi, AKumar, R Structural insights of cyclin dependent kinases: Implications in design of selective inhibitors. Eur J Med Chem 142:424-458 (2017)  
Target
Name:
Cyclin-dependent kinase 2
Synonyms:
CDK2 CDK2_HUMAN Cell division protein kinase 2 Protein cereblon/Cyclin-dependent kinase 2 | p33 protein kinase
Type:
Enzyme Subunit
Mol. Mass.:
33938.17
Organism:
Homo sapiens (Human)
Description:
P24941
Residue:
298
  
Inhibitor
Name:
BDBM50113281
Synonyms:
AT-7519
Type:
Small organic molecule
Emp. Form.:
C16H17Cl2N5O2
Mol. Mass.:
382.244
SMILES:
Clc1cccc(Cl)c1C(=O)Nc1c[nH]nc1C(=O)NC1CCNCC1
: