Target
Tyrosine-protein kinase BTK
Ligand
BDBM50468267
Substrate
Meas. Tech.
ChEMBL_1799118 (CHEMBL4271410)
IC50
0.520000±n/a nM
Citation
 Wang, LZhao, JYao, YWang, CZhang, JShu, XSun, XLi, YLiu, KYuan, HMa, X Covalent binding design strategy: A prospective method for discovery of potent targeted anticancer agents. Eur J Med Chem 142:493-505 (2017)  
Target
Name:
Tyrosine-protein kinase BTK
Synonyms:
AGMX1 Agammaglobulinaemia tyrosine kinase B cell progenitor kinase BPK BTK_HUMAN Tyrosine Kinase BTK Tyrosine-protein kinase BTK (BTK)
Type:
Enzyme
Mol. Mass.:
76289.95
Organism:
Homo sapiens (Human)
Description:
Q06187
Residue:
659
  
Inhibitor
Name:
BDBM50468267
Synonyms:
CHEMBL4280795
Type:
Small organic molecule
Emp. Form.:
C25H23ClN6O2
Mol. Mass.:
474.942
SMILES:
Nc1ncnc2n(nc(-c3ccc(Oc4ccccc4)cc3)c12)C1CCCN(C1)C(=O)\C=C\Cl
: