Target
Cyclin-dependent kinase 5 activator 1
Ligand
BDBM27217
Substrate
Meas. Tech.
ChEMBL_1799153 (CHEMBL4271445)
IC50
43±n/a nM
Citation
 Cascioferro, SParrino, BSpanò, VCarbone, AMontalbano, ABarraja, PDiana, PCirrincione, G 1,3,5-Triazines: A promising scaffold for anticancer drugs development. Eur J Med Chem 142:523-549 (2017)  
Target
Name:
Cyclin-dependent kinase 5 activator 1
Synonyms:
CDK5/p35 Cyclin-dependent kinase 5 regulatory subunit 1 | Cyclin-dependent kinase 5/CDK5 activator 1
Type:
Protein Complex
Mol. Mass.:
Description:
Components:
This complex has 2 components.
Component 1
Name:
Cyclin-dependent kinase 5
Synonyms:
CDK5 CDKN5 Cyclin-dependent kinase 5 (CDK5/ p25) Cyclin-dependent-like kinase 5 PSSALRE Tau protein kinase II catalytic subunit
Type:
Enzyme Subunit
Mol. Mass.:
33308.61
Organism:
Homo sapiens (Human)
Description:
Residue:
292
  
Component 2
Name:
Cyclin-dependent kinase 5 activator 1
Synonyms:
CD5R1_HUMAN CDK5R1 Cyclin-dependent kinase 5 (CDK5/p25) NCK5A p35
Type:
Enzyme Subunit
Mol. Mass.:
34077.43
Organism:
Homo sapiens (Human)
Description:
Q15078
Residue:
307
  
Inhibitor
Name:
BDBM27217
Synonyms:
(2R)-2-{[4-(benzylamino)-8-(propan-2-yl)pyrazolo[1,5-a][1,3,5]triazin-2-yl]amino}butan-1-ol pyrazolo[1,5-a]-1,3,5-triazine, 7a
Type:
Small organic molecule
Emp. Form.:
C19H26N6O
Mol. Mass.:
354.4493
SMILES:
CC[C@H](CO)Nc1nc(NCc2ccccc2)n2ncc(C(C)C)c2n1
: