Target
Poly [ADP-ribose] polymerase 1
Ligand
BDBM50468579
Substrate
Meas. Tech.
ChEMBL_1800450 (CHEMBL4272742)
IC50
>100000±n/a nM
Citation
 Murthy, SDesantis, JVerheugd, PMaksimainen, MMVenkannagari, HMassari, SAshok, YObaji, ENkizinkinko, YLüscher, BTabarrini, OLehtiö, L 4-(Phenoxy) and 4-(benzyloxy)benzamides as potent and selective inhibitors of mono-ADP-ribosyltransferase PARP10/ARTD10. Eur J Med Chem 156:93-102 (2018)  
Target
Name:
Poly [ADP-ribose] polymerase 1
Synonyms:
(ARTD1 or PARP1) 2.4.2.30 ADPRT ARTD1 Human diphtheria toxin-like ADP-ribosyltransferase (ARTD1 or PARP1) NT-PARP-1 PARP1 PPOL Poly [ADP-ribose] polymerase 1 (PARP) Poly [ADP-ribose] polymerase 1 (PARP1) Poly [ADP-ribose] polymerase 1, 28-kDa form Poly [ADP-ribose] polymerase 1, processed C-terminus Poly [ADP-ribose] polymerase-1 Poly(ADP-ribose) polymerase-1 (ARTD1/PARP1) Protein poly-ADP-ribosyltransferase PARP1 | Synonyms=ADPRT
Type:
Mol. Mass.:
113114.22
Organism:
Homo sapiens (Human)
Description:
P09874
Residue:
1014
  
Inhibitor
Name:
BDBM50468579
Synonyms:
CHEMBL4287262
Type:
Small organic molecule
Emp. Form.:
C14H11NO4
Mol. Mass.:
257.2414
SMILES:
NC(=O)c1ccc(Oc2ccc(cc2)C(O)=O)cc1
: