Target
Protein mono-ADP-ribosyltransferase PARP14
Ligand
BDBM50468579
Substrate
Meas. Tech.
ChEMBL_1800457 (CHEMBL4272749)
IC50
>10000±n/a nM
Citation
 Murthy, SDesantis, JVerheugd, PMaksimainen, MMVenkannagari, HMassari, SAshok, YObaji, ENkizinkinko, YLüscher, BTabarrini, OLehtiö, L 4-(Phenoxy) and 4-(benzyloxy)benzamides as potent and selective inhibitors of mono-ADP-ribosyltransferase PARP10/ARTD10. Eur J Med Chem 156:93-102 (2018)  
Target
Name:
Protein mono-ADP-ribosyltransferase PARP14
Synonyms:
(ARTD8 or PARP14) 2.4.2.- ADP-ribosyltransferase diphtheria toxin-like 8 B aggressive lymphoma protein 2 BAL2  KIAA1268 PAR14_HUMAN PARP14 Synonyms=BAL2
Type:
Mol. Mass.:
202812.41
Organism:
Homo sapiens (Human)
Description:
Q460N5
Residue:
1801
  
Inhibitor
Name:
BDBM50468579
Synonyms:
CHEMBL4287262
Type:
Small organic molecule
Emp. Form.:
C14H11NO4
Mol. Mass.:
257.2414
SMILES:
NC(=O)c1ccc(Oc2ccc(cc2)C(O)=O)cc1
: