Target
Poly [ADP-ribose] polymerase tankyrase-1
Ligand
BDBM50452662
Substrate
Meas. Tech.
ChEMBL_1800454 (CHEMBL4272746)
IC50
>100000±n/a nM
Citation
 Murthy, SDesantis, JVerheugd, PMaksimainen, MMVenkannagari, HMassari, SAshok, YObaji, ENkizinkinko, YLüscher, BTabarrini, OLehtiö, L 4-(Phenoxy) and 4-(benzyloxy)benzamides as potent and selective inhibitors of mono-ADP-ribosyltransferase PARP10/ARTD10. Eur J Med Chem 156:93-102 (2018)  
Target
Name:
Poly [ADP-ribose] polymerase tankyrase-1
Synonyms:
(ARTD5 or PARP5a) PARPL Poly [ADP-ribose] polymerase tankyrase-1 TINF1 TNKS1 Tankyrase 1 Tankyrase-1 Tankyrase-1 (TNKS1)
Type:
Enzyme
Mol. Mass.:
142058.03
Organism:
Homo sapiens (Human)
Description:
O95271
Residue:
1327
  
Inhibitor
Name:
BDBM50452662
Synonyms:
CHEMBL4208737
Type:
Small organic molecule
Emp. Form.:
C14H12FNO2
Mol. Mass.:
245.249
SMILES:
NC(=O)c1ccc(OCc2ccccc2F)cc1
: