Target
Zinc finger protein GLI1
Ligand
BDBM50468720
Substrate
Meas. Tech.
ChEMBL_1800974 (CHEMBL4273266)
IC50
55290±n/a nM
Citation
 Berardozzi, SBernardi, FInfante, PIngallina, CToscano, SDe Paolis, EAlfonsi, RCaimano, MBotta, BMori, MDi Marcotullio, LGhirga, F Synergistic inhibition of the Hedgehog pathway by newly designed Smo and Gli antagonists bearing the isoflavone scaffold. Eur J Med Chem 156:554-562 (2018)  
Target
Name:
Zinc finger protein GLI1
Synonyms:
GLI1_MOUSE Gli1 | Glioma-associated oncogene homolog
Type:
PROTEIN
Mol. Mass.:
118579.34
Organism:
Mus musculus
Description:
EBI_101259
Residue:
1111
  
Inhibitor
Name:
BDBM50468720
Synonyms:
CHEMBL4293248
Type:
Small organic molecule
Emp. Form.:
C26H21F3O6
Mol. Mass.:
486.4365
SMILES:
COc1cc(OC)c2c(c1)occ(-c1ccc(OCc3ccc(cc3)C(F)(F)F)c(OC)c1)c2=O
: