Target
Epidermal growth factor receptor
Ligand
BDBM50468984
Substrate
Meas. Tech.
ChEMBL_1801908 (CHEMBL4274200)
IC50
751±n/a nM
Citation
 Ammar, YASh El-Sharief, AMBelal, AAbbas, SYMohamed, YAMehany, ABMRagab, A Design, synthesis, antiproliferative activity, molecular docking and cell cycle analysis of some novel (morpholinosulfonyl) isatins with potential EGFR inhibitory activity. Eur J Med Chem 156:918-932 (2018)  
Target
Name:
Epidermal growth factor receptor
Synonyms:
EGF Receptor Substrate EGFR_HUMAN ERBB1 Epidermal Growth Factor Receptor erbB-1 Epidermal growth factor receptor (EGFR) HER1 Proto-oncogene c-ErbB-1 Tyrosine-Protein Kinase ErbB-1
Type:
Receptor Kinase Domain
Mol. Mass.:
134279.59
Organism:
Homo sapiens (Human)
Description:
P00533
Residue:
1210
  
Inhibitor
Name:
BDBM50468984
Synonyms:
CHEMBL4288648
Type:
Small organic molecule
Emp. Form.:
C18H17N3O5S
Mol. Mass.:
387.41
SMILES:
Oc1ccc(cc1)\N=C1/C(=O)Nc2ccc(cc12)S(=O)(=O)N1CCOCC1
: