Target
Tyrosine-protein kinase Lyn
Ligand
BDBM50413999
Substrate
Meas. Tech.
ChEMBL_1802632 (CHEMBL4274924)
IC50
0.400000±n/a nM
Citation
 Pathania, SRawal, RK Pyrrolopyrimidines: An update on recent advancements in their medicinal attributes. Eur J Med Chem 157:503-526 (2018)  
Target
Name:
Tyrosine-protein kinase Lyn
Synonyms:
JTK8 LYN_HUMAN Tyrosine-protein kinase Lyn (LYN) p53Lyn | p56Lyn
Type:
Protein
Mol. Mass.:
58575.92
Organism:
Homo sapiens (Human)
Description:
P07948
Residue:
512
  
Inhibitor
Name:
BDBM50413999
Synonyms:
CGP77675 | CHEMBL475584
Type:
Small organic molecule
Emp. Form.:
C26H29N5O2
Mol. Mass.:
443.5408
SMILES:
COc1cccc(c1)-c1cn(-c2ccc(CCN3CCC(O)CC3)cc2)c2ncnc(N)c12
: