Target
Carbonic anhydrase 9
Ligand
BDBM50469139
Substrate
Meas. Tech.
ChEMBL_1803461 (CHEMBL4275753)
Ki
0.550000±n/a nM
Citation
 Angeli, ATrallori, EFerraroni, MDi Cesare Mannelli, LGhelardini, CSupuran, CT Discovery of new 2, 5-disubstituted 1,3-selenazoles as selective human carbonic anhydrase IX inhibitors with potent anti-tumor activity. Eur J Med Chem 157:1214-1222 (2018)  
Target
Name:
Carbonic anhydrase 9
Synonyms:
CA-IX CAH9_HUMAN Carbonic anhydrase 9 (CA IX) Carbonic anhydrase 9 precursor Carbonic anhydrase IX (CAIX) Carbonic anhydrases; II & IX MN RCC-associated antigen G250
Type:
Enzyme
Mol. Mass.:
49669.03
Organism:
Homo sapiens (Human)
Description:
Catalytic domain of human cloned isozyme was used in the assay
Residue:
459
  
Inhibitor
Name:
BDBM50469139
Synonyms:
CHEMBL4292479
Type:
Small organic molecule
Emp. Form.:
C17H16N2O3SSe2
Mol. Mass.:
486.31
SMILES:
[#6]-[#8]-c1ccc([Se;v2][#6]-c2cnc([se;v2]2)-c2ccc(cc2)S([#7])(=O)=O)cc1
: