Target
Lanosterol 14-alpha demethylase
Ligand
BDBM50011478
Substrate
Meas. Tech.
ChEMBL_96761 (CHEMBL705239)
IC50
85.0±n/a nM
Citation
  TBA Bioorg Med Chem Lett 4:733-736 (1994)    Article 
Target
Name:
Lanosterol 14-alpha demethylase
Synonyms:
CP51A_HUMAN CYP51A1 Cytochrome P450 51 LDM P450-14DM P450LI Sterol 14-alpha demethylase
Type:
Protein
Mol. Mass.:
56817.21
Organism:
Homo sapiens (Human)
Description:
Q16850
Residue:
503
  
Inhibitor
Name:
BDBM50011478
Synonyms:
ITRAZOLE
Type:
Small organic molecule
Emp. Form.:
C35H38Cl2N8O4
Mol. Mass.:
705.633
SMILES:
CCC(C)n1ncn(-c2ccc(cc2)N2CCN(CC2)c2ccc(OCC3COC(Cn4cncn4)(O3)c3ccc(Cl)cc3Cl)cc2)c1=O
: