Target
Progesterone receptor
Ligand
BDBM50026619
Substrate
Meas. Tech.
ChEMBL_159709 (CHEMBL764185)
Ki
39.8±n/a nM
Citation
 Hoyte, RMRosner, WJohnson, ISZielinski, JHochberg, RB Synthesis and evaluation of potential radioligands for the progesterone receptor. J Med Chem 28:1695-9 (1985)  
Target
Name:
Progesterone receptor
Synonyms:
NR3C3 PRGR_RABIT
Type:
PROTEIN
Mol. Mass.:
98665.51
Organism:
Oryctolagus cuniculus
Description:
ChEMBL_775980
Residue:
930
  
Inhibitor
Name:
BDBM50026619
Synonyms:
17-Hydroxy-16-iodo-13-methyl-1,2,6,7,8,9,10,11,12,13,14,15,16,17-tetradecahydro-cyclopenta[a]phenanthren-3-one | CHEMBL47639
Type:
Small organic molecule
Emp. Form.:
C18H25IO2
Mol. Mass.:
400.2944
SMILES:
CC12CCC3C(CCC4=CC(=O)CCC34)C1C[C@@H](I)C2O
: