Target
Melatonin receptor type 1A/1B
Ligand
BDBM50408649
Substrate
Meas. Tech.
ChEMBL_104925 (CHEMBL714705)
Kd
2.3±n/a nM
Citation
 Depreux, PLesieur, DMansour, HAMorgan, PHowell, HERenard, PCaignard, DHPfeiffer, BDelagrange, PGuardiola, B Synthesis and structure-activity relationships of novel naphthalenic and bioisosteric related amidic derivatives as melatonin receptor ligands. J Med Chem 37:3231-9 (1994)  
Target
Name:
Melatonin receptor type 1A/1B
Synonyms:
Melatonin receptor
Type:
Mol. Mass.:
Description:
ASSAY_ID of ChEMBL is 104946
Components:
This complex has 2 components.
Component 1
Name:
Melatonin receptor type 1A
Synonyms:
MTNR1A MTR1A_HUMAN Mel1a melatonin receptor Melatonin receptor Melatonin receptor type 1 (MT1) | Melatonin receptor type 1A
Type:
Enzyme
Mol. Mass.:
39392.94
Organism:
Homo sapiens (Human)
Description:
P48039
Residue:
350
  
Component 2
Name:
Melatonin receptor type 1B
Synonyms:
MTNR1B Mel-1B-R Melatonin 1B Melatonin receptor type 1B | Melatonin receptor type 2 (MT2)
Type:
Enzyme
Mol. Mass.:
40203.54
Organism:
Homo sapiens (Human)
Description:
P49286
Residue:
362
  
Inhibitor
Name:
BDBM50408649
Synonyms:
CHEMBL37703
Type:
Small organic molecule
Emp. Form.:
C17H21NO2
Mol. Mass.:
271.3541
SMILES:
COc1ccc2cccc(CCNC(=O)C(C)C)c2c1
: