Target
Melatonin receptor type 1C
Ligand
BDBM9019
Substrate
Meas. Tech.
ChEMBL_104759 (CHEMBL710991)
Ki
0.176000±n/a nM
Citation
 Langlois, MBrémont, BShen, SPoncet, AAndrieux, JSicsic, SSerraz, IMathé-Allainmat, MRenard, PDelagrange, P Design and synthesis of new naphthalenic derivatives as ligands for 2-[125I]iodomelatonin binding sites. J Med Chem 38:2050-60 (1995)  
Target
Name:
Melatonin receptor type 1C
Synonyms:
CKB Mel-1C-R Melatonin receptor type 1C
Type:
PROTEIN
Mol. Mass.:
38595.98
Organism:
Gallus gallus
Description:
ChEMBL_104739
Residue:
346
  
Inhibitor
Name:
BDBM9019
Synonyms:
CHEMBL45 N-[2-(5-methoxy-1H-indol-3-yl)ethyl]acetamide
Type:
Small organic molecule
Emp. Form.:
C13H16N2O2
Mol. Mass.:
232.2783
SMILES:
COc1ccc2[nH]cc(CCNC(C)=O)c2c1
: