Target
A5LHX3/O14818/P20618/P25786/P25787/P25788/P25789/P28062/P28065/P28066/P28070/P28072/P28074/P40306/P49720/P49721/P60900/Q8TAA3/Q99436
Ligand
BDBM50470200
Substrate
Meas. Tech.
ChEMBL_129 (CHEMBL615353)
IC50
1000±n/a nM
Citation
 Iqbal, MChatterjee, SKauer, JCDas, MMessina, PFreed, BBiazzo, WSiman, R Potent inhibitors of proteasome. J Med Chem 38:2276-7 (1995)  
Target
Name:
A5LHX3/O14818/P20618/P25786/P25787/P25788/P25789/P28062/P28065/P28066/P28070/P28072/P28074/P40306/P49720/P49721/P60900/Q8TAA3/Q99436
Synonyms:
20S proteasome | 26S proteosome
Type:
Mol. Mass.:
Description:
Combinations of UniProts
Components:
This complex has 19 components.
Component 1
Name:
Proteasome subunit beta type-2
Synonyms:
20S proteasome PSMB2 | Proteasome Macropain subunit
Type:
PROTEIN
Mol. Mass.:
22837.53
Organism:
Homo sapiens (Human)
Description:
ChEMBL_1294233
Residue:
201
  
Component 2
Name:
Proteasome subunit beta type-1
Synonyms:
PSB1_HUMAN PSMB1 Proteasome subunit beta type-1/beta type-5
Type:
PROTEIN
Mol. Mass.:
26493.62
Organism:
Homo sapiens (Human)
Description:
ChEMBL_1366691
Residue:
241
  
Component 3
Name:
Proteasome subunit beta type-5
Synonyms:
20S proteasome chymotrypsin-like LMPX PSB5_HUMAN Proteasome Macropain subunit MB1 X
Type:
Protein
Mol. Mass.:
28480.96
Organism:
Homo sapiens (Human)
Description:
Residue:
263
  
Component 4
Name:
Proteasome subunit beta type-8
Synonyms:
26S proteosome Low molecular mass protein 7 Multicatalytic endopeptidase complex subunit C13 PSMB5i Proteasome component C13 Proteasome subunit beta-5i Y2
Type:
PROTEIN
Mol. Mass.:
30357.49
Organism:
Homo sapiens (Human)
Description:
ChEMBL_1446797
Residue:
276
  
Component 5
Name:
Proteasome subunit beta type-9
Synonyms:
LMP2 Macropain chain 7 PSB9_HUMAN PSMB9 Proteasome subunit beta-1i Really interesting new gene 12 protein
Type:
PROTEIN
Mol. Mass.:
23256.49
Organism:
Homo sapiens (Human)
Description:
ChEMBL_106197
Residue:
219
  
Component 6
Name:
Proteasome subunit beta type-6
Synonyms:
LMPY Multicatalytic endopeptidase complex delta chain PSMB6 Proteasome subunit Y | Y
Type:
PROTEIN
Mol. Mass.:
25349.89
Organism:
Homo sapiens (Human)
Description:
ChEMBL_106197
Residue:
239
  
Component 7
Name:
Proteasome subunit alpha type-1
Synonyms:
30 kDa prosomal protein Macropain subunit C2 NU PROS30 PSC2 Proteasome component C2 | Proteasome nu chain
Type:
PROTEIN
Mol. Mass.:
29555.77
Organism:
Homo sapiens (Human)
Description:
ChEMBL_106197
Residue:
263
  
Component 8
Name:
Proteasome subunit alpha type-2
Synonyms:
HC3 Multicatalytic endopeptidase complex subunit C3 PSC3 Proteasome component C3
Type:
PROTEIN
Mol. Mass.:
25900.29
Organism:
Homo sapiens (Human)
Description:
ChEMBL_106197
Residue:
234
  
Component 9
Name:
Proteasome subunit alpha type-3
Synonyms:
HC8 Multicatalytic endopeptidase complex subunit C8 PSC8 Proteasome component C8
Type:
PROTEIN
Mol. Mass.:
28426.36
Organism:
Homo sapiens (Human)
Description:
ChEMBL_106197
Residue:
255
  
Component 10
Name:
Proteasome subunit alpha type-4
Synonyms:
HC9 Multicatalytic endopeptidase complex subunit C9 PSC9 Proteasome component C9 | Proteasome subunit L
Type:
PROTEIN
Mol. Mass.:
29486.50
Organism:
Homo sapiens (Human)
Description:
ChEMBL_106197
Residue:
261
  
Component 11
Name:
Proteasome subunit alpha type-5
Synonyms:
Macropain zeta chain PSA5_HUMAN Proteasome zeta chain
Type:
PROTEIN
Mol. Mass.:
26398.14
Organism:
Homo sapiens (Human)
Description:
ChEMBL_106197
Residue:
241
  
Component 12
Name:
Proteasome subunit alpha type-6
Synonyms:
27 kDa prosomal protein Multicatalytic endopeptidase complex iota chain PROS27 PSMA6 p27K
Type:
PROTEIN
Mol. Mass.:
27399.66
Organism:
Homo sapiens (Human)
Description:
ChEMBL_106197
Residue:
246
  
Component 13
Name:
Proteasome subunit alpha type-7
Synonyms:
HSPC PSMA7 Proteasome subunit XAPC7
Type:
PROTEIN
Mol. Mass.:
27891.04
Organism:
Homo sapiens (Human)
Description:
ChEMBL_106197
Residue:
248
  
Component 14
Name:
Proteasome subunit alpha-type 8
Synonyms:
PSMA7L PSMA8_HUMAN | Proteasome subunit alpha type-7-like
Type:
PROTEIN
Mol. Mass.:
28537.53
Organism:
Homo sapiens (Human)
Description:
ChEMBL_106197
Residue:
256
  
Component 15
Name:
Proteasome subunit beta type-10
Synonyms:
LMP10 MECL1 Multicatalytic endopeptidase complex subunit MECl-1 PSMB10 Proteasome subunit beta-2i
Type:
PROTEIN
Mol. Mass.:
28940.51
Organism:
Homo sapiens (Human)
Description:
ChEMBL_106197
Residue:
273
  
Component 16
Name:
Proteasome subunit beta type-11
Synonyms:
PSB11_HUMAN Proteasome subunit beta-5t
Type:
PROTEIN
Mol. Mass.:
32529.58
Organism:
Homo sapiens (Human)
Description:
ChEMBL_106197
Residue:
300
  
Component 17
Name:
Proteasome subunit beta type-3
Synonyms:
PSB3_HUMAN Proteasome chain 13 Proteasome theta chain
Type:
PROTEIN
Mol. Mass.:
22948.68
Organism:
Homo sapiens (Human)
Description:
ChEMBL_106197
Residue:
205
  
Component 18
Name:
Proteasome subunit beta type-4
Synonyms:
26 kDa prosomal protein HsN3 Multicatalytic endopeptidase complex beta chain PROS26 PSMB4 Proteasome chain 3
Type:
PROTEIN
Mol. Mass.:
29202.40
Organism:
Homo sapiens (Human)
Description:
ChEMBL_106197
Residue:
264
  
Component 19
Name:
Proteasome subunit beta type-7
Synonyms:
Macropain chain Z PSB7_HUMAN Proteasome subunit Z | Z
Type:
PROTEIN
Mol. Mass.:
29968.13
Organism:
Homo sapiens (Human)
Description:
ChEMBL_106197
Residue:
277
  
Inhibitor
Name:
BDBM50470200
Synonyms:
CHEMBL2369773
Type:
Small organic molecule
Emp. Form.:
C30H45N5O10
Mol. Mass.:
635.7058
SMILES:
COC(=O)CCC(=O)N[C@@H](CCC(O)=O)C(=O)N[C@@H](C(C)C)C(=O)N[C@@H](CCCCN)C(=O)N[C@@H](Cc1ccccc1)C(O)=O
: