Target
cAMP-specific 3',5'-cyclic phosphodiesterase 4D
Ligand
BDBM50470787
Substrate
Meas. Tech.
ChEMBL_157200 (CHEMBL767095)
IC50
1680±n/a nM
Citation
 Duplantier, AJBiggers, MSChambers, RJCheng, JBCooper, KDamon, DBEggler, JFKraus, KGMarfat, AMasamune, HPillar, JSShirley, JTUmland, JPWatson, JW Biarylcarboxylic acids and -amides: inhibition of phosphodiesterase type IV versus [3H]rolipram binding activity and their relationship to emetic behavior in the ferret. J Med Chem 39:120-5 (1996)  
Target
Name:
cAMP-specific 3',5'-cyclic phosphodiesterase 4D
Synonyms:
DPDE3 Pde4d
Type:
PROTEIN
Mol. Mass.:
84520.85
Organism:
Mus musculus
Description:
ChEMBL_105062
Residue:
747
  
Inhibitor
Name:
BDBM50470787
Synonyms:
CHEMBL22461
Type:
Small organic molecule
Emp. Form.:
C26H28O4
Mol. Mass.:
404.4981
SMILES:
COc1ccc(cc1OCCCCCc1ccccc1)-c1ccc(C(O)=O)c(C)c1
: