Target
Melatonin receptor type 1C
Ligand
BDBM50470869
Substrate
Meas. Tech.
ChEMBL_104760 (CHEMBL710992)
Ki
6.0±n/a nM
Citation
 Mathé-Allainmat, MGaudy, FSicsic, SDangy-Caye, ALShen, SBrémont, BBenatalah, ZLanglois, MRenard, PDelagrange, P Synthesis of 2-amido-2,3-dihydro-1H-phenalene derivatives as new conformationally restricted ligands for melatonin receptors. J Med Chem 39:3089-95 (1996)  
Target
Name:
Melatonin receptor type 1C
Synonyms:
CKB Mel-1C-R Melatonin receptor type 1C
Type:
PROTEIN
Mol. Mass.:
38595.98
Organism:
Gallus gallus
Description:
ChEMBL_104739
Residue:
346
  
Inhibitor
Name:
BDBM50470869
Synonyms:
CHEMBL12477
Type:
Small organic molecule
Emp. Form.:
C17H19NO2
Mol. Mass.:
269.3383
SMILES:
CCC(=O)NC1Cc2cccc3ccc(OC)c(C1)c23
: