Target
Alpha-1B adrenergic receptor
Ligand
BDBM50403649
Substrate
Meas. Tech.
ChEMBL_34317 (CHEMBL648101)
Ki
0.309030±n/a nM
Citation
 Giardinà, DCrucianelli, MRomanelli, RLeonardi, APoggesi, EMelchiorre, C Synthesis and biological profile of the enantiomers of [4-(4-amino-6,7-dimethoxyquinazolin-2-yl)-cis-octahydroquinoxalin- 1-yl]furan-2-ylmethanone (cyclazosin), a potent competitive alpha 1B- adrenoceptor antagonist. J Med Chem 39:4602-7 (1996)  
Target
Name:
Alpha-1B adrenergic receptor
Synonyms:
ADA1B_HUMAN Adrenergic alpha1B Adrenergic receptor alpha Alpha 1B-adrenoreceptor | Alpha-1B adrenergic receptor
Type:
Enzyme
Mol. Mass.:
56862.13
Organism:
Homo sapiens (Human)
Description:
P35368
Residue:
520
  
Inhibitor
Name:
BDBM50403649
Synonyms:
CYCLAZOSIN
Type:
Small organic molecule
Emp. Form.:
C23H27N5O4
Mol. Mass.:
437.4916
SMILES:
COc1cc2nc(nc(N)c2cc1OC)N1CCN([C@H]2CCCC[C@@H]12)C(=O)c1ccco1
: