Target
Protein kinase C zeta type
Ligand
BDBM50471337
Substrate
Meas. Tech.
ChEMBL_162376 (CHEMBL767464)
IC50
>10000±n/a nM
Citation
 Hudkins, RLDiebold, JLAngeles, TSKnight, E Fused pyrrolo[2,3-c]carbazol-6-ones: novel immunostimulants that enhance human interferon-gamma activity. J Med Chem 40:2994-6 (1997)  
Target
Name:
Protein kinase C zeta type
Synonyms:
KPCZ_RAT Prkcz Protein kinase C zeta type | nPKC-zeta
Type:
PROTEIN
Mol. Mass.:
67722.31
Organism:
Rattus norvegicus
Description:
ChEMBL_104731
Residue:
592
  
Inhibitor
Name:
BDBM50471337
Synonyms:
CHEMBL99748
Type:
Small organic molecule
Emp. Form.:
C20H12N2O2
Mol. Mass.:
312.3215
SMILES:
O=C1Cc2c(N1)c1c3ccccc3oc1c1[nH]c3ccccc3c21
: