Target
cAMP-specific 3',5'-cyclic phosphodiesterase 4A/4B/4C/4D
Ligand
BDBM50010981
Substrate
Meas. Tech.
ChEMBL_157397 (CHEMBL763662)
IC50
4800±n/a nM
Citation
 Sawanishi, HSuzuki, HYamamoto, SWaki, YKasugai, SOhya, KSuzuki, NMiyamoto, KTakagi, K Selective inhibitors of cyclic AMP-specific phosphodiesterase: heterocycle-condensed purines. J Med Chem 40:3248-53 (1997)  
Target
Name:
cAMP-specific 3',5'-cyclic phosphodiesterase 4A/4B/4C/4D
Synonyms:
Phosphodiesterase 4
Type:
Mol. Mass.:
Description:
ASSAY_ID of ChEMBL is 788178
Components:
This complex has 4 components.
Component 1
Name:
cAMP-specific 3',5'-cyclic phosphodiesterase 4A
Synonyms:
3',5'-cyclic phosphodiesterase PDE46 PDE4A_HUMAN Phosphodiesterase 4A | Phosphodiesterase 4A (PDE4)
Type:
Enzyme
Mol. Mass.:
98113.27
Organism:
Homo sapiens (Human)
Description:
P27815
Residue:
886
  
Component 2
Name:
cAMP-specific 3',5'-cyclic phosphodiesterase 4D
Synonyms:
3',5'-cyclic phosphodiesterase PDE43 PDE4D_HUMAN | Phosphodiesterase 4D
Type:
Protein
Mol. Mass.:
91092.69
Organism:
Homo sapiens (Human)
Description:
Q08499
Residue:
809
  
Component 3
Name:
cAMP-specific 3',5'-cyclic phosphodiesterase 4B
Synonyms:
3',5'-cyclic phosphodiesterase Isoform PDE4B1 PDE4B PDE4B_HUMAN Phosphodiesterase 4B (PDE4B) Phosphodiesterase Type 4 (PDE4B)
Type:
Protein
Mol. Mass.:
83318.87
Organism:
Homo sapiens (Human)
Description:
Q07343
Residue:
736
  
Component 4
Name:
cAMP-specific 3',5'-cyclic phosphodiesterase 4C
Synonyms:
3',5'-cyclic phosphodiesterase NP_000914.2 PDE4C | PDE4C1
Type:
Enzyme Catalytic Domain
Mol. Mass.:
79875.54
Organism:
Homo sapiens (Human)
Description:
Q08493
Residue:
712
  
Inhibitor
Name:
BDBM50010981
Synonyms:
(Ro 20-1724)4-(3-Butoxy-4-methoxy-benzyl)-imidazolidin-2-one 4-(3-Butoxy-4-methoxy-benzyl)-imidazolidin-2-one(Ro 20-1724) CHEMBL18701 Ro-20-1724
Type:
Small organic molecule
Emp. Form.:
C15H22N2O3
Mol. Mass.:
278.3468
SMILES:
CCCCOc1cc(CC2CNC(=O)N2)ccc1OC
: