Target
Glutamate receptor ionotropic, NMDA 1
Ligand
BDBM50038161
Substrate
Meas. Tech.
ChEMBL_141012 (CHEMBL747502)
Ki
7.9±n/a nM
Citation
 Di Fabio, RCapelli, AMConti, NCugola, ADonati, DFeriani, AGastaldi, PGaviraghi, GHewkin, CTMicheli, FMissio, AMugnaini, MPecunioso, AQuaglia, AMRatti, ERossi, LTedesco, GTrist, DGReggiani, A Substituted indole-2-carboxylates as in vivo potent antagonists acting as the strychnine-insensitive glycine binding site. J Med Chem 40:841-50 (1997)  
Target
Name:
Glutamate receptor ionotropic, NMDA 1
Synonyms:
Glutamate (NMDA) receptor subunit zeta 1 Glutamate-NMDA-Channel Glutamate-NMDA-Polyamine NMDA Nmdar1 | phencyclidine
Type:
Enzyme Catalytic Domain
Mol. Mass.:
105533.40
Organism:
RAT
Description:
P35439
Residue:
938
  
Inhibitor
Name:
BDBM50038161
Synonyms:
6,7-Dichloro-3-hydroxy-5-nitro-3,4-dihydro-1H-quinoxalin-2-one 6,7-Dichloro-5-nitro-1,4-dihydro-quinoxaline-2,3-dione(ACEA 1021) | CHEMBL289832
Type:
Small organic molecule
Emp. Form.:
C8H3Cl2N3O4
Mol. Mass.:
276.033
SMILES:
[O-][N+](=O)c1c(Cl)c(Cl)cc2[n-]c(=[OH+])c(=O)[nH]c12
: