Target
DNA topoisomerase 2-alpha/2-beta
Ligand
BDBM50471911
Substrate
Meas. Tech.
ChEMBL_54200 (CHEMBL664230)
EC50
>1000±n/a nM
Citation
 Daley, LGuminski, YDemerseman, PKruczynski, AEtiévant, CImbert, THill, BTMonneret, C Synthesis and antitumor activity of new glycosides of epipodophyllotoxin, analogues of etoposide, and NK 611. J Med Chem 41:4475-85 (1998)  
Target
Name:
DNA topoisomerase 2-alpha/2-beta
Synonyms:
DNA topoisomerase II
Type:
Mol. Mass.:
Description:
ASSAY_ID of ChEMBL is 1821483
Components:
This complex has 2 components.
Component 1
Name:
DNA topoisomerase 2-alpha
Synonyms:
DNA topoisomerase 2-alpha DNA topoisomerase II (Topo II) DNA topoisomerase II, alpha isozyme TOP2A Topoisomerase I/II | Topoisomerase II alpha (HuTopoIIα)
Type:
Protein
Mol. Mass.:
174415.30
Organism:
Homo sapiens (Human)
Description:
P11388
Residue:
1531
  
Component 2
Name:
DNA topoisomerase 2-beta
Synonyms:
DNA topoisomerase II TOP2B | TOP2B_HUMAN
Type:
PROTEIN
Mol. Mass.:
183284.13
Organism:
Homo sapiens (Human)
Description:
ChEMBL_51583
Residue:
1626
  
Inhibitor
Name:
BDBM50471911
Synonyms:
CHEMBL342844
Type:
Small organic molecule
Emp. Form.:
C33H39NO12
Mol. Mass.:
641.6623
SMILES:
[H][C@]12COC(=O)[C@]1([H])[C@H](c1cc(OC)c(O)c(OC)c1)c1cc3OCOc3cc1[C@H]2OC1CC(C2OC(C)OCC2O1)N1CCOCC1
: