Target
Cannabinoid receptor 1
Ligand
BDBM50213819
Substrate
Meas. Tech.
ChEMBL_46820 (CHEMBL657224)
Ki
1819701±n/a nM
Citation
 Shim, JYCollantes, ERWelsh, WJSubramaniam, BHowlett, ACEissenstat, MAWard, SJ Three-dimensional quantitative structure-activity relationship study of the cannabimimetic (aminoalkyl)indoles using comparative molecular field analysis. J Med Chem 41:4521-32 (1998)  
Target
Name:
Cannabinoid receptor 1
Synonyms:
Brain-type cannabinoid receptor CB-R CNR1_RAT Cannabinoid receptor Cnr1 | Skr6
Type:
G Protein-Coupled Receptor (GPCR)
Mol. Mass.:
52856.55
Organism:
Rattus norvegicus (rat)
Description:
P20272
Residue:
473
  
Inhibitor
Name:
BDBM50213819
Synonyms:
CHEMBL421497
Type:
Small organic molecule
Emp. Form.:
C24H28N2O2
Mol. Mass.:
376.4913
SMILES:
COc1ccc(cc1)C(=O)c1c(C)n(CC2CCCCN2C)c2ccccc12
: