Target
Peroxisome proliferator-activated receptor gamma
Ligand
BDBM50472041
Substrate
Meas. Tech.
ChEMBL_154377 (CHEMBL758986)
EC50
0.301995±n/a nM
Citation
 Cobb, JEBlanchard, SGBoswell, EGBrown, KKCharifson, PSCooper, JPCollins, JLDezube, MHenke, BRHull-Ryde, EALake, DHLenhard, JMOliver, WOplinger, JPentti, MParks, DJPlunket, KDTong, WQ N-(2-Benzoylphenyl)-L-tyrosine PPARgamma agonists. 3. Structure-activity relationship and optimization of the N-aryl substituent. J Med Chem 41:5055-69 (1998)  
Target
Name:
Peroxisome proliferator-activated receptor gamma
Synonyms:
NR1C3 PPAR-gamma PPARG_HUMAN Peroxisome proliferator-activated receptor gamma (PPAR gamma) Peroxisome proliferator-activated receptor gamma (PPARĪ³) peroxisome proliferator-activated receptor gamma isoform 2
Type:
Nuclear Receptor
Mol. Mass.:
57613.46
Organism:
Homo sapiens (Human)
Description:
P37231
Residue:
505
  
Inhibitor
Name:
BDBM50472041
Synonyms:
CHEMBL147770
Type:
Small organic molecule
Emp. Form.:
C31H32N2O6
Mol. Mass.:
528.5956
SMILES:
CCCOC(=O)c1ccccc1NC(Cc1ccc(OCCc2nc(oc2C)-c2ccccc2)cc1)C(O)=O
: