Target
Leukotriene B4 receptor 2
Ligand
BDBM50472433
Substrate
Meas. Tech.
ChEMBL_99657 (CHEMBL704423)
IC50
1300±n/a nM
Citation
 Poudrel, JMHullot, PVidal, JPGirard, JPRossi, JCMuller, ABonne, CBezuglov, VSerkov, IRenard, PPfeiffer, B Synthesis and structure-activity relationships of new 1, 3-disubstituted cyclohexanes as structurally rigid leukotriene B(4) receptor antagonists. J Med Chem 42:5289-310 (1999)  
Target
Name:
Leukotriene B4 receptor 2
Synonyms:
BLT2R LT4R2_HUMAN LTB4-R 2 LTB4R2 Leukotriene B4 Leukotriene B4 receptor Leukotriene B4 receptor BLT2 Seven transmembrane receptor BLTR2
Type:
Enzyme Catalytic Domain
Mol. Mass.:
37964.86
Organism:
Homo sapiens (Human)
Description:
Leukotriene 2 0 HUMAN::Q9NPC1
Residue:
358
  
Inhibitor
Name:
BDBM50472433
Synonyms:
CHEMBL151371
Type:
Small organic molecule
Emp. Form.:
C21H27NaO3
Mol. Mass.:
350.427
SMILES:
[Na;v0+].[#8]-[#6](-[#6]-[#6]-[#6]-[#6]-c1ccccc1)\[#6]=[#6]/[#6@H]-1-[#6]-[#6]-[#6]\[#6](-[#6]1)=[#6]/[#6](-[#8-])=O
: