Target
Gastrin/cholecystokinin type B receptor
Ligand
BDBM50472886
Substrate
Meas. Tech.
ChEMBL_48108 (CHEMBL663095)
Ki
0.676083±n/a nM
Citation
 Ursini, ACapelli, AMCarr, RACassarà, PCorsi, MCurcuruto, OCurotto, GDal Cin, MDavalli, SDonati, DFeriani, AFinch, HFinizia, GGaviraghi, GMarien, MPentassuglia, GPolinelli, SRatti, EReggiani, AMTarzia, GTedesco, GTranquillini, METrist, DGVan Amsterdam, FTReggiani, A Synthesis and SAR of new 5-phenyl-3-ureido-1,5-benzodiazepines as cholecystokinin-B receptor antagonists. J Med Chem 43:3596-613 (2000)  
Target
Name:
Gastrin/cholecystokinin type B receptor
Synonyms:
CCK-2 receptor CCK-BR CCKRB Cholecystokinin receptor GASR_HUMAN | Gastrin/cholecystokinin type B receptor
Type:
G Protein-Coupled Receptor (GPCR)
Mol. Mass.:
48445.79
Organism:
Homo sapiens (Human)
Description:
Stable expression of human CCK-2 receptors in HEK 293 cells.
Residue:
447
  
Inhibitor
Name:
BDBM50472886
Synonyms:
CHEMBL421271
Type:
Small organic molecule
Emp. Form.:
C31H34FN5O3
Mol. Mass.:
543.6318
SMILES:
CN(C)c1cccc(NC(=O)NC2C(=O)N(CCC3CCCC3)c3ccccc3N(c3ccccc3F)C2=O)c1
: