Target
Gastrin/cholecystokinin type B receptor
Ligand
BDBM50449787
Substrate
Meas. Tech.
ChEMBL_48109 (CHEMBL663096)
Ki
1.9±n/a nM
Citation
 Ursini, ACapelli, AMCarr, RACassarà, PCorsi, MCurcuruto, OCurotto, GDal Cin, MDavalli, SDonati, DFeriani, AFinch, HFinizia, GGaviraghi, GMarien, MPentassuglia, GPolinelli, SRatti, EReggiani, AMTarzia, GTedesco, GTranquillini, METrist, DGVan Amsterdam, FTReggiani, A Synthesis and SAR of new 5-phenyl-3-ureido-1,5-benzodiazepines as cholecystokinin-B receptor antagonists. J Med Chem 43:3596-613 (2000)  
Target
Name:
Gastrin/cholecystokinin type B receptor
Synonyms:
CCK-2 receptor CCK-BR CCKRB Cholecystokinin receptor GASR_HUMAN | Gastrin/cholecystokinin type B receptor
Type:
G Protein-Coupled Receptor (GPCR)
Mol. Mass.:
48445.79
Organism:
Homo sapiens (Human)
Description:
Stable expression of human CCK-2 receptors in HEK 293 cells.
Residue:
447
  
Inhibitor
Name:
BDBM50449787
Synonyms:
CHEMBL2062154 | PD-134308
Type:
Small organic molecule
Emp. Form.:
C35H42N4O6
Mol. Mass.:
614.7312
SMILES:
[H][C@@]12C[C@@]3([H])C[C@@]([H])(C1)C(OC(=O)N[C@](C)(Cc1c[nH]c4ccccc14)C(=O)NC[C@H](NC(=O)CCC(O)=O)c1ccccc1)[C@@]([H])(C2)C3
: