Target
Gag-Pol polyprotein
Ligand
BDBM50222125
Substrate
Meas. Tech.
ChEMBL_196794 (CHEMBL799737)
Ki
114815362±n/a nM
Citation
 Wu, RSWolpert-DeFilippes, MKQuinn, FR Quantitative structure--activity correlations of rifamycins as inhibitors of viral RNA-directed DNA polymerase and mammalian alpha and beta DNA polymerases. J Med Chem 23:256-61 (1980)  
Target
Name:
Gag-Pol polyprotein
Synonyms:
POL_WMSV pol
Type:
PROTEIN
Mol. Mass.:
32733.90
Organism:
Woolly monkey sarcoma virus
Description:
ChEMBL_196792
Residue:
294
  
Inhibitor
Name:
BDBM50222125
Synonyms:
CHEMBL330258
Type:
Small organic molecule
Emp. Form.:
C46H65N3O11
Mol. Mass.:
836.0218
SMILES:
CCCCN(CCCC)\N=C\c1cc2c3C(=O)C4(C)Oc3c(C)c(O)c2c(O)c1NC(=O)\C(C)=C/C=C/C(C)C(O)C(C)C(O)C(C)C(OC(C)=O)C(C)C(OC)\C=C\O4
: