Target
Somatostatin receptor type 3
Ligand
BDBM81767
Substrate
Meas. Tech.
ChEMBL_200830 (CHEMBL807043)
Kd
0.213796±n/a nM
Citation
 Gademann, KKimmerlin, THoyer, DSeebach, D Peptide folding induces high and selective affinity of a linear and small beta-peptide to the human somatostatin receptor 4. J Med Chem 44:2460-8 (2001)  
Target
Name:
Somatostatin receptor type 3
Synonyms:
SOMATOSTATIN SST3 SS3-R SSR-28 SSTR3 | Somatostatin receptor type 3 (SSTR3)
Type:
Protein
Mol. Mass.:
45855.97
Organism:
Homo sapiens (Human)
Description:
P32745
Residue:
418
  
Inhibitor
Name:
BDBM81767
Synonyms:
15-28-Somatostatin-28 CB6417646 | Somatostatin-14
Type:
Small organic molecule
Emp. Form.:
C76H104N18O19S2
Mol. Mass.:
1637.878
SMILES:
C[C@@H](O)[C@@H]1NC(=O)[C@H](Cc2ccccc2)NC(=O)[C@@H](NC(=O)[C@H](CCCCN)NC(=O)[C@H](Cc2c[nH]c3ccccc23)NC(=O)[C@H](Cc2ccccc2)NC(=O)[C@H](Cc2ccccc2)NC(=O)[C@H](CC(N)=O)NC(=O)[C@H](CCCCN)NC(=O)[C@H](CSSC[C@H](NC(=O)[C@H](CO)NC1=O)C(O)=O)NC(=O)CNC(=O)[C@H](C)N)[C@@H](C)O
: