Target
Neuronal acetylcholine receptor subunit alpha-4/beta-2
Ligand
BDBM50473413
Substrate
Meas. Tech.
ChEMBL_144341 (CHEMBL750233)
Ki
2.3±n/a nM
Citation
 Romanelli, MNManetti, DScapecchi, SBorea, PADei, SBartolini, AGhelardini, CGualtieri, FGuandalini, LVarani, K Structure-affinity relationships of a unique nicotinic ligand: N(1)-dimethyl-N(4)-phenylpiperazinium iodide (DMPP). J Med Chem 44:3946-55 (2001)  
Target
Name:
Neuronal acetylcholine receptor subunit alpha-4/beta-2
Synonyms:
Neuronal acetylcholine receptor alpha4/beta2 Neuronal acetylcholine receptor; alpha4/beta2
Type:
Mol. Mass.:
Description:
Components:
This complex has 0 components.
Component 1
Name:
Neuronal acetylcholine receptor subunit alpha-4
Synonyms:
ACHA4_RAT Cholinergic, Nicotinic Alpha4Beta2 Chrna4 Neuronal acetylcholine receptor (alpha4beta2 nAChR) Neuronal acetylcholine receptor subunit alpha 4 beta 2 | Neuronal acetylcholine receptor subunit alpha-4
Type:
Enzyme
Mol. Mass.:
70196.44
Organism:
Rattus norvegicus (Rat)
Description:
P09483
Residue:
630
  
Component 2
Name:
Neuronal acetylcholine receptor subunit beta-2
Synonyms:
ACHB2_RAT Chrnb2 Neuronal acetylcholine receptor non-alpha-1 chain
Type:
Enzyme
Mol. Mass.:
56910.32
Organism:
Rattus norvegicus (Rat)
Description:
P12390
Residue:
500
  
Inhibitor
Name:
BDBM50473413
Synonyms:
CHEMBL126487
Type:
Small organic molecule
Emp. Form.:
C12H20BrN3
Mol. Mass.:
286.211
SMILES:
[Br-].C[N+]1(C)CCN(CC1)c1cccc(N)c1
: