Target
Mitogen-activated protein kinase 13
Ligand
BDBM50473624
Substrate
Meas. Tech.
ChEMBL_124318 (CHEMBL732626)
IC50
127±n/a nM
Citation
 McKenna, JMHalley, FSouness, JEMcLay, IMPickett, SDCollis, AJPage, KAhmed, I An algorithm-directed two-component library synthesized via solid-phase methodology yielding potent and orally bioavailable p38 MAP kinase inhibitors. J Med Chem 45:2173-84 (2002)  
Target
Name:
Mitogen-activated protein kinase 13
Synonyms:
MAP kinase 13 MAPK 13 Mapk13 Mitogen-activated protein kinase p38 delta Stress-activated protein kinase 4
Type:
PROTEIN
Mol. Mass.:
42081.17
Organism:
Mus musculus
Description:
ChEMBL_105000
Residue:
366
  
Inhibitor
Name:
BDBM50473624
Synonyms:
CHEMBL71792 | RPR-235316
Type:
Small organic molecule
Emp. Form.:
C26H33FN6O5
Mol. Mass.:
528.5758
SMILES:
COCCCNc1nccc(n1)-c1[nH]c(nc1-c1ccc(F)cc1)[C@H]1OC[C@](C)(CO1)C(=O)NCCOC
: