Target
Alpha-2C adrenergic receptor
Ligand
BDBM50473663
Substrate
Meas. Tech.
ChEMBL_33654 (CHEMBL649235)
EC50
28±n/a nM
Citation
 Hodson, SJBishop, MJSpeake, JDNavas, FGarrison, DTBigham, ECSaussy, DLLiacos, JAIrving, PEGobel, MJSherman, BW 2-(Anilinomethyl)imidazolines as alpha1 adrenergic receptor agonists: the discovery of alpha1a subtype selective 2'-alkylsulfonyl-substituted analogues. J Med Chem 45:2229-39 (2002)  
Target
Name:
Alpha-2C adrenergic receptor
Synonyms:
ADA2C_HUMAN ADRA2L2 Adrenergic alpha2C Adrenergic receptor alpha Alpha-2 adrenergic receptor subtype C4 Alpha-2C adrenoreceptor | adrenergic, alpha-2C-, receptor [Homo sapiens]
Type:
Enzyme
Mol. Mass.:
49552.32
Organism:
Homo sapiens (Human)
Description:
P18825
Residue:
462
  
Inhibitor
Name:
BDBM50473663
Synonyms:
CHEMBL553276
Type:
Small organic molecule
Emp. Form.:
C13H20ClN3S
Mol. Mass.:
285.836
SMILES:
Cl.CC(C)Sc1ccccc1NCC1=NCCN1
: