Target
Plasminogen
Ligand
BDBM50027285
Substrate
Meas. Tech.
ChEBML_155243
Ki
3900±n/a nM
Citation
 Tidwell, RRGeratz, JDDubovi, EJ Aromatic amidines: comparison of their ability to block respiratory syncytial virus induced cell fusion and to inhibit plasmin, urokinase, thrombin, and trypsin. J Med Chem 26:294-8 (1983)  
Target
Name:
Plasminogen
Synonyms:
Activation peptide PLG Plasmin Plasmin heavy chain A, short form | Plasmin light chain B
Type:
Enzyme
Mol. Mass.:
90579.18
Organism:
Homo sapiens (Human)
Description:
Residue:
810
  
Inhibitor
Name:
BDBM50027285
Synonyms:
2-{4-[2-(4-Carbamimidoyl-phenoxy)-ethoxy]-phenyl}-1H-benzoimidazole-5-carboxamidine | CHEMBL101261
Type:
Small organic molecule
Emp. Form.:
C23H22N6O2
Mol. Mass.:
414.4598
SMILES:
NC(=N)c1ccc(OCCOc2ccc(cc2)-c2nc3ccc(cc3[nH]2)C(N)=N)cc1
: