Target
Mu-type opioid receptor
Ligand
BDBM50474152
Substrate
Meas. Tech.
ChEMBL_145450 (CHEMBL752039)
Ki
7.2±n/a nM
Citation
 Takayama, HIshikawa, HKurihara, MKitajima, MAimi, NPonglux, DKoyama, FMatsumoto, KMoriyama, TYamamoto, LTWatanabe, KMurayama, THorie, S Studies on the synthesis and opioid agonistic activities of mitragynine-related indole alkaloids: discovery of opioid agonists structurally different from other opioid ligands. J Med Chem 45:1949-56 (2002)  
Target
Name:
Mu-type opioid receptor
Synonyms:
M-OR-1 Mu opioid receptor OPIATE Mu OPRM_CAVPO
Type:
Enzyme Catalytic Domain
Mol. Mass.:
11165.58
Organism:
GUINEA PIG
Description:
P97266
Residue:
98
  
Inhibitor
Name:
BDBM50474152
Synonyms:
CHEBI:6956 | CHEMBL299031
Type:
Small organic molecule
Emp. Form.:
C23H30N2O4
Mol. Mass.:
398.4953
SMILES:
[H][C@@]1(CC)CN2CCc3c([nH]c4cccc(OC)c34)[C@]2([H])C[C@]1([H])C(=C/OC)\C(=O)OC
: